{"text_format":"1","workbook":"xlsx","n_sheets":5,"sheets":["Read Me","Screening Tool","Calculation","Sheet1","Macro1"],"not_rendered":{"charts":0,"images":3,"macros":1,"external_links":0,"defined_names":8,"comments":2,"pivot_tables":0},"unopened":[],"bounds":{"document_bytes":16777216,"sheet_cells":100000,"rows_first":2000,"rows_last":500,"rows_between":2000,"halvings":0,"cell_chars":16384,"cell_head_chars":4096},"cells_cut":0,"cells_raw":0,"read":"whole","date_system":"1900"}

{"sheet":"Read Me","index":0,"n_rows":49,"n_cols":1,"rows_kept":49,"cut":false,"hidden":false,"merged":[[48,0,48,10],[13,0,42,10],[45,0,45,10],[7,0,10,10]]}
[]
[]
[]
["About this Tool"]
[]
[]
["Purpose"]
["This multi-land use screening tool was developed to assist project applicants and planners determine whether a discretionary development project may be below the Bay Area Air Quality Management District's (BAAQMD's) CEQA thresholds for air quality impacts related to construction and operation of the project. This tool does not work for projects which have construction-related activities overlapping with operational activities, and vice versa."]
[]
[]
[]
[]
["How this Tool was Developed"]
["Each land use type available in the California Emissions Estimator Model (CalEEMod) version 2020.4.0 was modeled using default parameters and inputs for both construction and operation. All wood-burning appliance were removed from the model runs because the installation of wood-burning devices in new development is prohibited per BAAQMD Regulation 6, Rule 3. No mitigation was applied. \n\nEach land use type was run in CalEEMod for 100,000 square feet of the size metric applicable for a construction year of 2020 and an operational year of 2021 to represent the most conservative emissions estimates. In the instance of residential land uses, 100 dwelling units equated to 100,000 square feet except in the cases of mobile home parks and single family residences, in which 83 units and 56 units equaled 100,000 square feet, respectively.\n\nBecause CalEEMod version 2020.4.0 uses the California Air Resources Board's EMFAC2017 model, the mobile source emissions factors were replaced with EMFAC2021 results for all model runs conducted. All model runs were conducted for the summer season which generally results in higher emissions and is therefore more conservative. Average daily emissions for each land use were then divided by the building area included in the model run (i.e., 100,000 square feet) to obtain average daily emissions per square foot.\n\nThe average daily emissions for each land use type were normalized to the NOx thresholds (54 lb/day for both construction and operation). Preliminary modeling conducted in CalEEMod confirmed that NOx is the most restrictive pollutant; therefore, NOx was used for the purposes of developing the screening tool. Using the normalized average daily emissions, a 100-point system was developed, where 100 points means that the 54 lb/day NOx limit has been exceeded. Each land use type was given a point value per dominant land use metric (e.g., X points per dwelling unit for residential land uses, X points per 1,000 square feet for nonresidential land uses). \n\nAn input table was created that pulls the point values for each land use type. By entering a project's land use types and sizes, users can see if their project would exceed the construction and/or operational NOx threshold (which is the surrogate for all other criteria air pollutants and precursors). If the project could exceed either the construction or operational threshold, the tool states that BAAQMD's recommendation would be to conduct additional analysis to determine the potential impact of the project with regard to air quality"]
[]
[]
[]
[]
[]
[]
[]
[]
[]
[]
[]
[]
[]
[]
[]
[]
[]
[]
[]
[]
[]
[]
[]
[]
[]
[]
[]
[]
[]
[]
["Project Example 1"]
["The project applicant is seeking to construct a mixed-use development project with 50 units of high-rise residential, 50,000 square feet of retail space, and 100 parking spaces in a parking lot onsite.\n\nUsing the drop-down menus in the screening tool, the project applicant selects these land use types and enters the sizes.\n\nUpon inputting all land use types, the screening tool indicates that neither construction or operational thresholds would be exceeded and no further analysis is recommended by BAAQMD to determine a significance conclusion with regard to air quality."]
[]
["Project Example 2"]
["The project applicant is seeking to construct a mixed-use development project with 300 hotel rooms, a 25,000 square foot restaurant, and separate enclosed parking garage for 500 vehicles. The project applicant would like to construct the land uses at the same time to expedite the construction schedule.\n\nUsing the drop-down menus in the screening tool, the user selects these land use types and enters the sizes. The user also checks the box for each land use type entered that says \"Has Overlapping Construction Phases.\" \n\nUpon inputting all land use types, the screening tool indicates that the construction thresholds would be exceeded and further analysis is recommended by BAAQMD to determine a significance conclusion with regard to air quality. The screening tool also indicates that the operational thresholds would not be exceeded and thus no further analysis would be required for operation-related air quality impacts."]

{"sheet":"Screening Tool","index":1,"n_rows":41,"n_cols":7,"rows_kept":41,"cut":false,"hidden":false,"merged":[[4,1,4,4],[31,1,31,3],[32,1,32,3],[33,1,33,3],[7,1,7,4],[9,1,9,5],[31,4,31,5],[32,4,32,5],[33,4,33,5]]}
[]
[]
[]
[null,"Multi-land Use Screening Tool Overview"]
[null,"This screening tool helps to determine whether the daily construction or operational emissions associated with a proposed land use development project with multiple land use types would exceed BAAQMD's average daily thresholds."]
[]
[null,"Instructions"]
[null,"Use the drop-down menus to select the land use category and land use type for each type of land use included in the project. Enter the proposed size of each land use based on the default units that are autopopulated in column D.\n\nThe tool will estimate whether the project may exceed the construction thresholds, operational thresholds, or both, and whether further analysis is needed before making a significance determination. This tool will not work for projects which have construction-related activities overlapping with operational activities, and vice versa."]
[]
[null,"Construction and Operation Screening Tool"]
[null,"Land Use Category","Land Use Type","Unit","Project \nLand Use Size","Has Overlapping Construction Phases?"]
[null,"Residential","Apartments Mid Rise",{"$f":"IF(ISBLANK(C12),\"\",VLOOKUP(C12,Sheet1!$C$3:$E$71,2,FALSE))","v":"DU"},40,null,true]
[null,"Commercial","General Office Building",{"$f":"IF(ISBLANK(C13),\"\",VLOOKUP(C13,Sheet1!$C$3:$E$71,2,FALSE))","v":"KSF"},4,null,true]
[null,"Parking","Enclosed Parking Structure",{"$f":"IF(ISBLANK(C14),\"\",VLOOKUP(C14,Sheet1!$C$3:$E$71,2,FALSE))","v":"Spaces"},18,null,true]
[null,null,null,{"$f":"IF(ISBLANK(C15),\"\",VLOOKUP(C15,Sheet1!$C$3:$E$71,2,FALSE))","v":""},null,null,false]
[null,null,null,{"$f":"IF(ISBLANK(C16),\"\",VLOOKUP(C16,Sheet1!$C$3:$E$71,2,FALSE))","v":""},null,null,false]
[null,null,null,{"$f":"IF(ISBLANK(C17),\"\",VLOOKUP(C17,Sheet1!$C$3:$E$71,2,FALSE))","v":""},null,null,false]
[null,null,null,{"$f":"IF(ISBLANK(C18),\"\",VLOOKUP(C18,Sheet1!$C$3:$E$71,2,FALSE))","v":""},null,null,false]
[null,null,null,{"$f":"IF(ISBLANK(C19),\"\",VLOOKUP(C19,Sheet1!$C$3:$E$71,2,FALSE))","v":""},null,null,false]
[null,null,null,{"$f":"IF(ISBLANK(C20),\"\",VLOOKUP(C20,Sheet1!$C$3:$E$71,2,FALSE))","v":""},null,null,false]
[null,null,null,{"$f":"IF(ISBLANK(C21),\"\",VLOOKUP(C21,Sheet1!$C$3:$E$71,2,FALSE))","v":""},null,null,false]
[null,null,null,{"$f":"IF(ISBLANK(C22),\"\",VLOOKUP(C22,Sheet1!$C$3:$E$71,2,FALSE))","v":""},null,null,false]
[null,null,null,{"$f":"IF(ISBLANK(C23),\"\",VLOOKUP(C23,Sheet1!$C$3:$E$71,2,FALSE))","v":""},null,null,false]
[null,null,null,{"$f":"IF(ISBLANK(C24),\"\",VLOOKUP(C24,Sheet1!$C$3:$E$71,2,FALSE))","v":""},null,null,false]
[null,null,null,{"$f":"IF(ISBLANK(C25),\"\",VLOOKUP(C25,Sheet1!$C$3:$E$71,2,FALSE))","v":""},null,null,false]
[null,null,null,{"$f":"IF(ISBLANK(C26),\"\",VLOOKUP(C26,Sheet1!$C$3:$E$71,2,FALSE))","v":""},null,null,false]
[null,null,null,{"$f":"IF(ISBLANK(C27),\"\",VLOOKUP(C27,Sheet1!$C$3:$E$71,2,FALSE))","v":""},null,null,false]
[null,null,null,{"$f":"IF(ISBLANK(C28),\"\",VLOOKUP(C28,Sheet1!$C$3:$E$71,2,FALSE))","v":""},null,null,false]
[null,null,null,{"$f":"IF(ISBLANK(C29),\"\",VLOOKUP(C29,Sheet1!$C$3:$E$71,2,FALSE))","v":""},null,null,false]
[null,null,null,{"$f":"IF(ISBLANK(C30),\"\",VLOOKUP(C30,Sheet1!$C$3:$E$71,2,FALSE))","v":""},null,null,false]
[null,null,null,{"$f":"IF(ISBLANK(C31),\"\",VLOOKUP(C31,Sheet1!$C$3:$E$71,2,FALSE))","v":""},null,null,false]
[null,"Exceeds Construction Threshold?",null,null,{"$f":"IF(COUNT(E12:E31)=0,\"\",IF(Calculation!E24>100,\"YES\",IF(Calculation!E24=0,\"\",\"NO\")))","v":"NO"},null,{"$f":"IF(OR(COUNT(C12:C31)=0,COUNT(E12:E31)=0),\"\",\"Modeling Not Required\")","v":""}]
[null,"Exceeds Operational Threshold?",null,null,{"$f":"IF(COUNT(E12:E31)=0,\"\",IF(Calculation!G24>100,\"YES\",IF(Calculation!G24=0,\"\",\"NO\")))","v":"NO"}]
[null,"BAAQMD's Recommendation",null,null,{"$f":"IF(COUNT(E12:E31)=0,\"\",IF(OR(E32=\"YES\",E33=\"YES\"),\"Further Analysis Required\",IF(OR(COUNTA(C12:C31)=0,COUNT(E12:E31)=0),\"\",\"Further Analysis Not Required\")))","v":"Further Analysis Not Required"}]
[]
[null,"Developed by"]
[]
[]
[]
[]
[null,"Last updated:","2022-05-06"]

{"sheet":"Calculation","index":2,"n_rows":24,"n_cols":7,"rows_kept":24,"cut":false,"hidden":false,"merged":[[1,3,1,4],[1,5,1,6]]}
[]
[null,null,null,"Construction",null,"Operations"]
[null,null,null,"Points per unit","total points","Points per unit","total points"]
[null,null,null,{"$f":"IF(ISBLANK('Screening Tool'!C12),0,VLOOKUP('Screening Tool'!C12,Sheet1!$C$3:$H$70,4,FALSE))","v":0.21811923447611178},{"$f":"D4*'Screening Tool'!E12*IF('Screening Tool'!G12=TRUE,2,1)","v":17.449538758088941},{"$f":"IF(ISBLANK('Screening Tool'!C12),0,VLOOKUP('Screening Tool'!C12,Sheet1!$C$3:$H$70,6,FALSE))","v":0.13225976661593097},{"$f":"'Screening Tool'!E12*Calculation!F4","v":5.2903906646372389}]
[null,null,null,{"$f":"IF(ISBLANK('Screening Tool'!C13),0,VLOOKUP('Screening Tool'!C13,Sheet1!$C$3:$H$70,4,FALSE))","v":0.22112074900178988},{"$f":"D5*'Screening Tool'!E13*IF('Screening Tool'!G13=TRUE,2,1)","v":1.768965992014319},{"$f":"IF(ISBLANK('Screening Tool'!C13),0,VLOOKUP('Screening Tool'!C13,Sheet1!$C$3:$H$70,6,FALSE))","v":0.13077016742770167},{"$f":"'Screening Tool'!E13*Calculation!F5","v":0.52308066971080669}]
[null,null,null,{"$f":"IF(ISBLANK('Screening Tool'!C14),0,VLOOKUP('Screening Tool'!C14,Sheet1!$C$3:$H$70,4,FALSE))","v":8.8563954288861352E-2},{"$f":"D6*'Screening Tool'!E14*IF('Screening Tool'!G14=TRUE,2,1)","v":3.1883023543990086},{"$f":"IF(ISBLANK('Screening Tool'!C14),0,VLOOKUP('Screening Tool'!C14,Sheet1!$C$3:$H$70,6,FALSE))","v":3.5068493150684934E-4},{"$f":"'Screening Tool'!E14*Calculation!F6","v":6.3123287671232884E-3}]
[null,null,null,{"$f":"IF(ISBLANK('Screening Tool'!C15),0,VLOOKUP('Screening Tool'!C15,Sheet1!$C$3:$H$70,4,FALSE))","v":0},{"$f":"D7*'Screening Tool'!E15*IF('Screening Tool'!G15=TRUE,2,1)","v":0},{"$f":"IF(ISBLANK('Screening Tool'!C15),0,VLOOKUP('Screening Tool'!C15,Sheet1!$C$3:$H$70,6,FALSE))","v":0},{"$f":"'Screening Tool'!E15*Calculation!F7","v":0}]
[null,null,null,{"$f":"IF(ISBLANK('Screening Tool'!C16),0,VLOOKUP('Screening Tool'!C16,Sheet1!$C$3:$H$70,4,FALSE))","v":0},{"$f":"D8*'Screening Tool'!E16*IF('Screening Tool'!G16=TRUE,2,1)","v":0},{"$f":"IF(ISBLANK('Screening Tool'!C16),0,VLOOKUP('Screening Tool'!C16,Sheet1!$C$3:$H$70,6,FALSE))","v":0},{"$f":"'Screening Tool'!E16*Calculation!F8","v":0}]
[null,null,null,{"$f":"IF(ISBLANK('Screening Tool'!C17),0,VLOOKUP('Screening Tool'!C17,Sheet1!$C$3:$H$70,4,FALSE))","v":0},{"$f":"D9*'Screening Tool'!E17*IF('Screening Tool'!G17=TRUE,2,1)","v":0},{"$f":"IF(ISBLANK('Screening Tool'!C17),0,VLOOKUP('Screening Tool'!C17,Sheet1!$C$3:$H$70,6,FALSE))","v":0},{"$f":"'Screening Tool'!E17*Calculation!F9","v":0}]
[null,null,null,{"$f":"IF(ISBLANK('Screening Tool'!C18),0,VLOOKUP('Screening Tool'!C18,Sheet1!$C$3:$H$70,4,FALSE))","v":0},{"$f":"D10*'Screening Tool'!E18*IF('Screening Tool'!G18=TRUE,2,1)","v":0},{"$f":"IF(ISBLANK('Screening Tool'!C18),0,VLOOKUP('Screening Tool'!C18,Sheet1!$C$3:$H$70,6,FALSE))","v":0},{"$f":"'Screening Tool'!E18*Calculation!F10","v":0}]
[null,null,null,{"$f":"IF(ISBLANK('Screening Tool'!C19),0,VLOOKUP('Screening Tool'!C19,Sheet1!$C$3:$H$70,4,FALSE))","v":0},{"$f":"D11*'Screening Tool'!E19*IF('Screening Tool'!G19=TRUE,2,1)","v":0},{"$f":"IF(ISBLANK('Screening Tool'!C19),0,VLOOKUP('Screening Tool'!C19,Sheet1!$C$3:$H$70,6,FALSE))","v":0},{"$f":"'Screening Tool'!E19*Calculation!F11","v":0}]
[null,null,null,{"$f":"IF(ISBLANK('Screening Tool'!C20),0,VLOOKUP('Screening Tool'!C20,Sheet1!$C$3:$H$70,4,FALSE))","v":0},{"$f":"D12*'Screening Tool'!E20*IF('Screening Tool'!G20=TRUE,2,1)","v":0},{"$f":"IF(ISBLANK('Screening Tool'!C20),0,VLOOKUP('Screening Tool'!C20,Sheet1!$C$3:$H$70,6,FALSE))","v":0},{"$f":"'Screening Tool'!E20*Calculation!F12","v":0}]
[null,null,null,{"$f":"IF(ISBLANK('Screening Tool'!C21),0,VLOOKUP('Screening Tool'!C21,Sheet1!$C$3:$H$70,4,FALSE))","v":0},{"$f":"D13*'Screening Tool'!E21*IF('Screening Tool'!G21=TRUE,2,1)","v":0},{"$f":"IF(ISBLANK('Screening Tool'!C21),0,VLOOKUP('Screening Tool'!C21,Sheet1!$C$3:$H$70,6,FALSE))","v":0},{"$f":"'Screening Tool'!E21*Calculation!F13","v":0}]
[null,null,null,{"$f":"IF(ISBLANK('Screening Tool'!C22),0,VLOOKUP('Screening Tool'!C22,Sheet1!$C$3:$H$70,4,FALSE))","v":0},{"$f":"D14*'Screening Tool'!E22*IF('Screening Tool'!G22=TRUE,2,1)","v":0},{"$f":"IF(ISBLANK('Screening Tool'!C22),0,VLOOKUP('Screening Tool'!C22,Sheet1!$C$3:$H$70,6,FALSE))","v":0},{"$f":"'Screening Tool'!E22*Calculation!F14","v":0}]
[null,null,null,{"$f":"IF(ISBLANK('Screening Tool'!C23),0,VLOOKUP('Screening Tool'!C23,Sheet1!$C$3:$H$70,4,FALSE))","v":0},{"$f":"D15*'Screening Tool'!E23*IF('Screening Tool'!G23=TRUE,2,1)","v":0},{"$f":"IF(ISBLANK('Screening Tool'!C23),0,VLOOKUP('Screening Tool'!C23,Sheet1!$C$3:$H$70,6,FALSE))","v":0},{"$f":"'Screening Tool'!E23*Calculation!F15","v":0}]
[null,null,null,{"$f":"IF(ISBLANK('Screening Tool'!C24),0,VLOOKUP('Screening Tool'!C24,Sheet1!$C$3:$H$70,4,FALSE))","v":0},{"$f":"D16*'Screening Tool'!E24*IF('Screening Tool'!G24=TRUE,2,1)","v":0},{"$f":"IF(ISBLANK('Screening Tool'!C24),0,VLOOKUP('Screening Tool'!C24,Sheet1!$C$3:$H$70,6,FALSE))","v":0},{"$f":"'Screening Tool'!E24*Calculation!F16","v":0}]
[null,null,null,{"$f":"IF(ISBLANK('Screening Tool'!C25),0,VLOOKUP('Screening Tool'!C25,Sheet1!$C$3:$H$70,4,FALSE))","v":0},{"$f":"D17*'Screening Tool'!E25*IF('Screening Tool'!G25=TRUE,2,1)","v":0},{"$f":"IF(ISBLANK('Screening Tool'!C25),0,VLOOKUP('Screening Tool'!C25,Sheet1!$C$3:$H$70,6,FALSE))","v":0},{"$f":"'Screening Tool'!E25*Calculation!F17","v":0}]
[null,null,null,{"$f":"IF(ISBLANK('Screening Tool'!C26),0,VLOOKUP('Screening Tool'!C26,Sheet1!$C$3:$H$70,4,FALSE))","v":0},{"$f":"D18*'Screening Tool'!E26*IF('Screening Tool'!G26=TRUE,2,1)","v":0},{"$f":"IF(ISBLANK('Screening Tool'!C26),0,VLOOKUP('Screening Tool'!C26,Sheet1!$C$3:$H$70,6,FALSE))","v":0},{"$f":"'Screening Tool'!E26*Calculation!F18","v":0}]
[null,null,null,{"$f":"IF(ISBLANK('Screening Tool'!C27),0,VLOOKUP('Screening Tool'!C27,Sheet1!$C$3:$H$70,4,FALSE))","v":0},{"$f":"D19*'Screening Tool'!E27*IF('Screening Tool'!G27=TRUE,2,1)","v":0},{"$f":"IF(ISBLANK('Screening Tool'!C27),0,VLOOKUP('Screening Tool'!C27,Sheet1!$C$3:$H$70,6,FALSE))","v":0},{"$f":"'Screening Tool'!E27*Calculation!F19","v":0}]
[null,null,null,{"$f":"IF(ISBLANK('Screening Tool'!C28),0,VLOOKUP('Screening Tool'!C28,Sheet1!$C$3:$H$70,4,FALSE))","v":0},{"$f":"D20*'Screening Tool'!E28*IF('Screening Tool'!G28=TRUE,2,1)","v":0},{"$f":"IF(ISBLANK('Screening Tool'!C28),0,VLOOKUP('Screening Tool'!C28,Sheet1!$C$3:$H$70,6,FALSE))","v":0},{"$f":"'Screening Tool'!E28*Calculation!F20","v":0}]
[null,null,null,{"$f":"IF(ISBLANK('Screening Tool'!C29),0,VLOOKUP('Screening Tool'!C29,Sheet1!$C$3:$H$70,4,FALSE))","v":0},{"$f":"D21*'Screening Tool'!E29*IF('Screening Tool'!G29=TRUE,2,1)","v":0},{"$f":"IF(ISBLANK('Screening Tool'!C29),0,VLOOKUP('Screening Tool'!C29,Sheet1!$C$3:$H$70,6,FALSE))","v":0},{"$f":"'Screening Tool'!E29*Calculation!F21","v":0}]
[null,null,null,{"$f":"IF(ISBLANK('Screening Tool'!C30),0,VLOOKUP('Screening Tool'!C30,Sheet1!$C$3:$H$70,4,FALSE))","v":0},{"$f":"D22*'Screening Tool'!E30*IF('Screening Tool'!G30=TRUE,2,1)","v":0},{"$f":"IF(ISBLANK('Screening Tool'!C30),0,VLOOKUP('Screening Tool'!C30,Sheet1!$C$3:$H$70,6,FALSE))","v":0},{"$f":"'Screening Tool'!E30*Calculation!F22","v":0}]
[null,null,null,{"$f":"IF(ISBLANK('Screening Tool'!C31),0,VLOOKUP('Screening Tool'!C31,Sheet1!$C$3:$H$70,4,FALSE))","v":0},{"$f":"D23*'Screening Tool'!E31*IF('Screening Tool'!G31=TRUE,2,1)","v":0},{"$f":"IF(ISBLANK('Screening Tool'!C31),0,VLOOKUP('Screening Tool'!C31,Sheet1!$C$3:$H$70,6,FALSE))","v":0},{"$f":"'Screening Tool'!E31*Calculation!F23","v":0}]
[null,null,null,"Total points",{"$f":"SUM(E4:E23)","v":22.406807104502271},null,{"$f":"SUM(G4:G23)","v":5.8197836631151691}]

{"sheet":"Sheet1","index":3,"n_rows":71,"n_cols":20,"rows_kept":71,"cut":false,"hidden":false,"merged":[]}
[]
[null,"Land Use Category","Land Use Subcategory","Land Use Unit","Construction","Points per unit - Construction","Operation","Points per unit - Operation"]
[null,"Commercial","Bank","KSF",52,0.22112074900178988,73,0.98365296803652946]
[null,"Commercial","General Office Building","KSF",52,0.22112074900178988,546,0.13077016742770167]
[null,"Commercial","Government (Civic Center)","KSF",52,0.22112074900178988,194,0.31822831050228301]
[null,"Commercial","Government Office Building","KSF",52,0.22112074900178988,282,0.22493556570268894]
[null,"Commercial","Hospital","KSF",52,0.22112074900178988,492,0.1637645865043125]
[null,"Commercial","Medical Office Building","KSF",52,0.22112074900178988,190,0.3415667174023338,null,null,null,null,null,"Commercial","Education","Industrial","Parking","Recreational","Residential","Retail"]
[null,"Commercial","Office Park","KSF",52,0.22112074900178988,492,0.14173515981735157,null,null,null,null,null,"Bank","Daycare Center","General Heavy Industry","Enclosed Parking Structure","Arena ","Apartments High Rise","Auto Care Center"]
[null,"Commercial","Pharmacy-Drug Store (no Drive-Thru)","KSF",52,0.22112074900178988,80,1.0145063419583966,null,null,null,null,null,"General Office Building","School – Elementary","General Light Industry","Enclosed Parking w/ Elevator","City Park","Apartments Low Rise","Convenience Market (24-hr)"]
[null,"Commercial","Pharmacy-Drug Store (w/ Drive-Thru)","KSF",52,0.22112074900178988,63,1.128681887366819,null,null,null,null,null,"Government (Civic Center)","School – High School","Industrial Park","Other Asphalt Surfaces","Fast Food Rest No DriveThru ","Apartments Mid Rise","Convenience Market w/ Gas Pumps"]
[null,"Commercial","Research & Development","KSF",52,0.22112074900178988,485,0.14460679857940129,null,null,null,null,null,"Government Office Building","College – Junior (2-year)","Manufacturing","Other Non-Asphalt Surfaces","Fast Food Rest w DriveThru","Condo-Townhouse","Discount Club"]
[null,"Education","Daycare Center","KSF",52,0.22140988572215339,147,0.43061897513952302,null,null,null,null,null,"Hospital","School – Junior High","Refrig Warehouse- No Rail","Parking Lot","Golf Course","Condo-Townhouse Hi-Rise","Electronic Superstore"]
[null,"Education ","School – Elementary","KSF",52,0.22140988572215339,313,0.20497716894977167,null,null,null,null,null,"Medical Office Building","Library","Refrig Warehouse- Rail","Unenclosed Parking Structure","Health Club","Congregate Care (Assisted Living)","Free-Standing Discount Store"]
[null,"Education","School – High School","KSF",52,0.22140988572215339,406,0.172648401826484,null,null,null,null,null,"Office Park","College – University (4-year)","Unrefrig Warehouse- No Rail","Unenclosed Parking Structure w/ Elevator","High Turnover (Sit Down Restaurant)","Mobile Home Park ","Free-Standing Discount Superstore"]
[null,"Education","College – Junior (2-year)","KSF",52,0.22140988572215339,299,0.23490613901572802,null,null,null,null,null,"Pharmacy-Drug Store (no Drive-Thru)","Worship Place","Unrefrig Warehouse- Rail",null,"Hotel ","Retirement Community","Gas-Service Station "]
[null,"Education","School – Junior High","KSF",52,0.22140988572215339,304,0.21065956367326227,null,null,null,null,null,"Pharmacy-Drug Store (w/ Drive-Thru)",null,null,null,"Motel","Single Family Housing","Hardware-Paint Store"]
[null,"Education","Library","KSF",52,0.22140988572215339,88,0.81052257737189237,null,null,null,null,null,"Research & Development",null,null,null,"Movie Theater (no matinee)",null,"Home Improve Superstore"]
[null,"Education","College – University (4-year)","KSF",52,0.22103496621246382,599,0.12837686917378696,null,null,null,null,null,null,null,null,null,"Quality Restaurant",null,"Regional Shopping Center"]
[null,"Education","Worship Place","KSF",52,0.22140988572215339,234,0.155738203957382,null,null,null,null,null,null,null,null,null,"Racquet Club",null,"Strip Mall"]
[null,"Industrial","General Heavy Industry","KSF",52,0.22140988572215339,718.95511856102485,9.912734652460678E-2,null,null,null,null,null,null,null,null,null,"Recreational Swimming Pool",null,"Supermarket"]
[null,"Industrial","General Light Industry","KSF",52,0.32014319151865617,843.30199581472357,0.10020497209538304]
[null,"Industrial","Industrial Park","KSF",52,0.22140988572215339,1065.2568452615799,8.0207001522069984E-2]
[null,"Industrial","Manufacturing","KSF",52,0.22140988572215339,718.95511856102485,9.912734652460678E-2]
[null,"Industrial","Refrig Warehouse- No Rail","KSF",52,0.22140988572215339,1319.8738787182558,7.0272957889396234E-2]
[null,"Industrial","Refrig Warehouse- Rail","KSF",52,0.22140988572215339,1319.8738787182558,7.0272957889396234E-2]
[null,"Industrial","Unrefrig Warehouse- No Rail","KSF",52,0.22140988572215339,1423.3374627691824,6.5748351090816837E-2]
[null,"Industrial","Unrefrig Warehouse- Rail","KSF",52,0.22140988572215339,1423.3374627691824,6.5748351090816837E-2]
[null,"Parking","Enclosed Parking Structure","Spaces",3057,8.8563954288861352E-2,282426.7782426778,3.5068493150684934E-4]
[null,"Parking","Enclosed Parking w/ Elevator","Spaces",3057,8.8563954288861352E-2,282426.7782426778,3.5068493150684934E-4]
[null,"Parking","Other Asphalt Surfaces","KSF",1223,0.22140988572215339,112970.71129707113,8.7671232876712331E-4]
[null,"Parking","Other Non-Asphalt Surfaces","KSF",1223,0.22140988572215339,112970.71129707113,8.7671232876712331E-4]
[null,"Parking","Parking Lot","Spaces",3057,8.8563954288861352E-2,282427,3.5068493150684934E-4]
[null,"Parking","Unenclosed Parking Structure","Spaces",3057,8.8563954288861352E-2,282427,3.5068493150684934E-4]
[null,"Parking","Unenclosed Parking Structure w/ Elevator","Spaces",3057,8.8563954288861352E-2,282427,3.5068493150684934E-4]
[null,"Recreational","Arena ","KSF",180,0.2490005073566717,514,0.1667681380010147]
[null,"Recreational","City Park","Acres",1,9.644631905237377,2871,0.5738614849807856]
[null,"Recreational","Fast Food Rest No DriveThru ","KSF",52,0.22140988572215339,10,4.6713343480466767]
[null,"Recreational","Fast Food Rest w DriveThru","KSF",52,0.22140988572215339,12,5.2767021816336879]
[null,"Recreational","Golf Course","Acres",1,9.644631905237377,426,4.5969032148195095E-2]
[null,"Recreational","Health Club","KSF",52,0.22140988572215339,201,0.38318619989852865]
[null,"Recreational","High Turnover (Sit Down Restaurant)","KSF",52,0.22140988572215339,51,1.3251141552511412]
[null,"Recreational","Hotel ","Rooms",52,0.32028176263718905,544,0.15805695846298332]
[null,"Recreational","Motel","Rooms",52,0.43426644222753558,719,0.1303797769606036]
[null,"Recreational","Movie Theater (no matinee)","KSF",52,0.21844081323635228,36,1.2499074416882634]
[null,"Recreational","Quality Restaurant","KSF",52,0.22140988572215339,79,0.95049213597158788]
[null,"Recreational","Racquet Club","KSF",52,0.22140988572215339,295,0.21891425672247583]
[null,"Recreational","Recreational Swimming Pool","KSF",2164,0.22140988572215339,252,0.26589446981227799]
[null,"Residential","Apartments High Rise","DU",38,0.16348616274266831,114,0.12270116692034501]
[null,"Residential","Apartments Low Rise","DU",76,0.24057870370370366,107.75539525277621,0.15663318112633176]
[null,"Residential","Apartments Mid Rise","DU",38,0.21811923447611178,112.36305752364306,0.13225976661593097]
[null,"Residential","Condo-Townhouse","DU",76,0.24057870370370366,108,0.15703805175038049]
[null,"Residential","Condo-Townhouse Hi-Rise","DU",38,0.17877145438121048,112,0.13225976661593097]
[null,"Residential","Congregate Care (Assisted Living)","DU",76,0.24057870370370366,117,0.10420294266869609]
[null,"Residential","Mobile Home Park ","DU",63,0.29100527347020505,111,0.13871725985074576]
[null,"Residential","Retirement Community","DU",76,0.24268899036022323," 118   ",9.9200405885337378E-2]
[null,"Residential","Single Family Housing","DU",46,0.39423898053889028,50,0.237564049893182]
[null,"Retail","Auto Care Center","KSF",52,0.22112074900178988,277,0.28098427194317604]
[null,"Retail","Convenience Market (24-hr)","KSF",52,0.22112074900178988,7,8.7437300862506326]
[null,"Retail","Convenience Market w/ Gas Pumps","KSF",52,0.22112074900178988,12,6.5139482496194816]
{"$rows_left_out":12}
{"sheet":"Macro1","index":4,"n_rows":0,"n_cols":0,"rows_kept":0,"cut":false,"hidden":false,"merged":[]}